{"text_format":"1","workbook":"xlsx","n_sheets":3,"sheets":["Instructions","FundSplits","ActiveFunds"],"not_rendered":{"charts":0,"images":0,"macros":1,"external_links":0,"defined_names":30,"comments":0,"pivot_tables":0},"unopened":[],"bounds":{"document_bytes":16777216,"sheet_cells":100000,"rows_first":2000,"rows_last":500,"rows_between":2000,"halvings":0,"cell_chars":16384,"cell_head_chars":4096},"cells_cut":0,"cells_raw":0,"read":"whole","date_system":"1900"}

{"sheet":"Instructions","index":0,"n_rows":11,"n_cols":2,"rows_kept":11,"cut":false,"hidden":false,"merged":[[22,0,22,1],[4,0,4,1],[6,0,6,1],[0,0,0,1],[1,0,1,1],[2,0,2,1],[3,0,3,1]]}
["2025 - 27 Central Service Fund Split Form"]
["This is your agency proposal of fund source impacts when central services increase or decrease funding for your agency."]
["Please complete and submit this form in excel along with your other agency documentation in the Agency Budget System (ABS). "]
["Fund splits in this form are the fund splits from the Enacted 2024 Supplemental Budget CSM"]
["Program and Subprogram detail is required for certain agencies. These columns will be blank if this detail isn't required."]
[]
["Steps to complete the form"]
["Step 1","On the Fund Split tab, filter on your agency by using the dropdown option"]
["Step 2","Review fund splits for each service"]
["Step 3","Update columns I - S where appropriate - Each column must equal 100%"]
["Step 4","Send updated fund split information to your assigned budget advisor and cc the central service model budget advisor."]

{"sheet":"FundSplits","index":1,"n_rows":380,"n_cols":19,"rows_kept":380,"cut":false,"hidden":false,"merged":[]}
[1,{"$f":"LEFT(VLOOKUP(A1,ActiveFunds!$H$4:$I$150,2,0),3)","v":"011"},null,{"$f":"VLOOKUP(A1,ActiveFunds!$H$4:$I$150,2,0)","v":"011-House of Representatives           "},null,"Central Service Fund Splits"]
[null,"DuplicateCheck"]
[]
[]
[{"$f":"LEFT(F5,3)","v":""},{"$f":"TRIM(LEFT(G5,3))","v":""},{"$f":"TRIM(LEFT(H5,4))","v":""},{"$f":"LEFT(I5,3)","v":""},{"$f":"MID(I5,5,1)","v":""},null,null,{"$f":"_xlfn.SINGLE(IF(AND(LEFT(F9,3)=\"300\",LEFT(G9,3)=\"030\"),ActiveFunds!#REF!,IF(AND(LEFT(F9,3)=\"300\",LEFT(G101,3)=\"040\"),ActiveFunds!#REF!,\"\")))","v":""},null,"All Columns by Agency must equal 100%"]
["Agency Code","Program Code","Subprogram Code","Account","AppType","Agency","Program","Subprogram (DSHS P030 & P040)","Account and Approp Title","Auditor","AttGen","OAH","Facilities & Services Only","WaTech","Debt Services ","Workers' Comp","All Other","Risk Mgmt Division","Self Insurance"]
[null,null,null,null,null,"Percent Totals (only applies when one agency chosen)",null,null,null,{"$f":"IF(AgyChoice=1,\"\",SUM(J8:J979))","v":""},"","","","","","","","",""]
["011","","","001","1","011-House of Representatives",null,null,"001-1 General Fund-State",1,1,1,1,1,1,1,1,1,1]
["012","","","001","1","012-Senate",null,null,"001-1 General Fund-State",1,1,1,1,1,1,1,1,1,1]
["013","","","108","1","013-Joint Transportation Committee",null,null,"108-1 Motor Vehicle Account-State",1,1,1,1,1,1,1,1,1,1]
["014","","","553","1","014-Jt Leg Audit & Review Committee",null,null,"553-1 Performance Audits of Govt Acct-State",1,1,1,1,1,1,1,1,1,1]
["020","","","553","1","020-LEAP Committee",null,null,"553-1 Performance Audits of Govt Acct-State",1,1,1,1,1,1,1,1,1,1]
["035","","","600","1","035-Office of the State Actuary",null,null,"600-1 Dept of Retirement Systems Expense-State",1,1,1,1,1,1,1,1,1,1]
["036","","","001","1","036-State Legislative Labor Relations",null,null,"001-1 General Fund-State",1,1,1,1,1,1,1,1,1,1]
["037","","","001","1","037-Office of Legislative Support Svcs",null,null,"001-1 General Fund-State",1,1,1,1,1,1,1,1,1,1]
["038","","","001","1","038-Joint Legislative Systems Comm",null,null,"001-1 General Fund-State",1,1,1,1,1,1,1,1,1,1]
["040","","","001","1","040-Statute Law Committee",null,null,"001-1 General Fund-State",0.8,0.8,0.8,0.8,0.8,0.8,0.8,0.8,0.8,0.8]
["040","","","197","6","040-Statute Law Committee",null,null,"197-6 Statute Law Committee Publications-Non-Appropriated",0.2,0.2,0.2,0.2,0.2,0.2,0.2,0.2,0.2,0.2]
["045","","","001","1","045-Supreme Court",null,null,"001-1 General Fund-State",1,1,1,1,1,1,1,1,1,1]
["048","","","001","1","048-Court of Appeals",null,null,"001-1 General Fund-State",1,1,1,1,1,1,1,1,1,1]
["050","","","001","1","050-Commission on Judicial Conduct",null,null,"001-1 General Fund-State",1,1,1,1,1,1,1,1,1,1]
["055","","","001","1","055-Administrative Office of the Courts",null,null,"001-1 General Fund-State",1,1,1,1,1,1,1,1,1,1]
["056","","","001","1","056-Office of Public Defense",null,null,"001-1 General Fund-State",1,1,1,1,1,1,1,1,1,1]
["057","","","001","1","057-Office of Civil Legal Aid",null,null,"001-1 General Fund-State",1,1,1,1,1,1,1,1,1,1]
["075","","","001","1","075-Office of the Governor",null,null,"001-1 General Fund-State",1,1,1,1,1,1,1,1,1,1]
["080","","","001","1","080-Office of the Lieutenant Governor",null,null,"001-1 General Fund-State",1,1,1,1,1,1,1,1,1,1]
["082","","","001","1","082-Public Disclosure Commission",null,null,"001-1 General Fund-State",1,1,1,1,1,1,1,1,1,1]
["083","","","26H","1","083-Washington State Leadership Board",null,null,"26H-1 WA St Leadership Board-State",1,1,1,1,1,1,1,1,1,1]
["085","","","001","1","085-Office of the Secretary of State",null,null,"001-1 General Fund-State",0.56999999999999995,0.56999999999999995,0.56999999999999995,0.56999999999999995,0.56999999999999995,0.56999999999999995,0.56999999999999995,0.56999999999999995,0.56999999999999995,0.56999999999999995]
["085","","","006","1","085-Office of the Secretary of State",null,null,"006-1 Public Records Effic/Presrv/Access-State",0.08,0.08,0.08,0.08,0.08,0.08,0.08,0.08,0.08,0.08]
["085","","","14E","1","085-Office of the Secretary of State",null,null,"14E-1 WA State Heritage Center Account-State",0.11,0.11,0.11,0.11,0.11,0.11,0.11,0.11,0.11,0.11]
["085","","","407","6","085-Office of the Secretary of State",null,null,"407-6 Secretary of State's Revolving Acct-Non-Appropriated",0.15,0.15,0.15,0.15,0.15,0.15,0.15,0.15,0.15,0.15]
["085","","","441","1","085-Office of the Secretary of State",null,null,"441-1 Local Government Archives Account-State",0.09,0.09,0.09,0.09,0.09,0.09,0.09,0.09,0.09,0.09]
["086","","","001","1","086-Governor's Office of Indian Affairs",null,null,"001-1 General Fund-State",1,1,1,1,1,1,1,1,1,1]
["087","","","001","1","087-Asian-Pacific-American Affrs",null,null,"001-1 General Fund-State",1,1,1,1,1,1,1,1,1,1]
["090","","","404","1","090-Office of the State Treasurer",null,null,"404-1 State Treasurer's Service Account-State",1,1,1,1,1,1,1,1,1,1]
["095","","","001","1","095-Office of the State Auditor",null,null,"001-1 General Fund-State",0,0.01,0,0.01,0,0,0.01,0,0.01,0.01]
["095","","","413","6","095-Office of the State Auditor",null,null,"413-6 Municipal Revolving Account-Non-Appropriated",0.6,0.54,0.6,0.22,0.6,0.6,0.62,0.6,0.6,0.6]
["095","","","483","1","095-Office of the State Auditor",null,null,"483-1 Auditing Services Revolving Acct-State",0.13,0.17,0.13,0.35,0.13,0.13,0.13,0.13,0.13,0.13]
["095","","","553","1","095-Office of the State Auditor",null,null,"553-1 Performance Audits of Govt Acct-State",0.02,0.03,0.02,0.02,0.02,0.02,0.03,0.02,0.02,0.02]
{"$rows_left_out":341}
{"sheet":"ActiveFunds","index":2,"n_rows":863,"n_cols":28,"rows_kept":863,"cut":false,"hidden":true,"merged":[]}
[null,null,null,null,null,null,null,null,null,null,{"$f":"COUNTIF(AgencyFund,Agency)","v":0},null,null,"",{"$f":"IF(pgmcheck=1,OFFSET(AgencyProgram,MATCH((AgyCode),AgencyProgram,0)-1,4,COUNTIF(AgencyProgram,AgyCode)),PgmList)","v":{"$error":"#VALUE!"}},null,null,null,"IF(AgyChoice=1,FundList,OFFSET(AgencyFund,MATCH((Agency),AgencyFund,0)-1,1,COUNTIF(AgencyFund,Agency)))"]
[null,null,"AgencyFund Table",null,null,null,null,null,"distinct agency list",null,null,"Distinct Fund List",null,null,"Programcheck",null,{"$f":"IFERROR(INDEX($N$4:$N$67,MATCH(AgyCode,Table_clallam_Titles_Entity[Agency],0)),0)","v":0},null,{"$f":"IF(pgmcheck=1,OFFSET(AgencyProgram,MATCH((AgyCode),AgencyProgram,0)-1,4,COUNTIF(AgencyProgram,AgyCode)),OFFSET(pgmcheck,0,1))","v":0},{"$f":"IF(pgmcheck=1,OFFSET(AgencyProgram,MATCH((AgyCode),AgencyProgram,0)-1,4,COUNTIF(AgencyProgram,AgyCode)),PgmList)","v":{"$error":"#VALUE!"}},null,null,null,"DSHS SubProgList for 030 and 040"]
[null,null,"Agency","Fund","Column1",null,null,null,"Agency",null,null,"Fund",null,null,"Agency","ProgramCode","BudgetType","SummFlag","ProgramTitle60","Program2",null,null,null,"agency","Program","Subprogram","Title35","(No column name)"]
[1,{"$f":"LEFT(Table_clallam_Oversight_ActiveFunds[[#This Row],[Agency]],3)","v":"011"},"011-House of Reps","001-1 General Fund-State",{"$f":"LEFT(Table_clallam_Oversight_ActiveFunds[[#This Row],[Fund]],5)","v":"001-1"},null,{"$f":"LEFT(I4,3)","v":"011"},1,"011-House of Representatives           ",{"$f":"LEFT(I4,3)","v":"011"},{"$f":"MID(L4,1,5)","v":"001-0"},"001-0 General Fund-Fed Grnt",null,1,"103","ADM","O","0","Program Support                    ","ADM-Program Support     ",null,1,{"$f":"X4&Y4","v":"300030"},"300","030","2000","State Facility Services            ","2000-State Facility Svcs "]
[1,{"$f":"LEFT(Table_clallam_Oversight_ActiveFunds[[#This Row],[Agency]],3)","v":"011"},"011-House of Reps","108-1 Motor Vehicle Acct-State",{"$f":"LEFT(Table_clallam_Oversight_ActiveFunds[[#This Row],[Fund]],5)","v":"108-1"},null,{"$f":"LEFT(I5,3)","v":"012"},2,"012-Senate                             ","012",{"$f":"MID(L5,1,5)","v":"001-1"},"001-1 General Fund-State",null,1,"103","CSH","O","0","Community Services and Housing     ","CSH-Comm Svcs & Housing ",null,1,{"$f":"X5&Y5","v":"300040"},"300","040","1000","Community Services                 ","1000-Community Services  "]
[1,{"$f":"LEFT(Table_clallam_Oversight_ActiveFunds[[#This Row],[Agency]],3)","v":"012"},"012-Senate","001-1 General Fund-State",{"$f":"LEFT(Table_clallam_Oversight_ActiveFunds[[#This Row],[Fund]],5)","v":"001-1"},null,"013",3,"013-Joint Transportation Committee     ","013","001-2","001-2 General Fund-Federal",null,1,"103","EDC","O","0","Econ Development & Competitiveness ","EDC-Econ Dev & Compet   ",null,1,"300040","300","040","2000","Residential Habilitation Services  ","2000-Resid Habilitation  "]
[1,{"$f":"LEFT(Table_clallam_Oversight_ActiveFunds[[#This Row],[Agency]],3)","v":"012"},"012-Senate","108-1 Motor Vehicle Acct-State",{"$f":"LEFT(Table_clallam_Oversight_ActiveFunds[[#This Row],[Fund]],5)","v":"108-1"},null,"014",4,"014-Jt Leg Audit & Review Committee    ","014","001-7","001-7 General Fund-Local",null,1,"103","ENG","O","0","Energy and Innovation              ","ENG-Energy & Innovation ",null,1,"300040","300","040","8000","Special Projects                   ","8000-Special Projects    "]
[1,{"$f":"LEFT(Table_clallam_Oversight_ActiveFunds[[#This Row],[Agency]],3)","v":"013"},"013-Jt Trans Committee","108-1 Motor Vehicle Acct-State",{"$f":"LEFT(Table_clallam_Oversight_ActiveFunds[[#This Row],[Fund]],5)","v":"108-1"},null,"020",5,"020-LEAP Committee                     ","020","001-A","001-A General Fund-Fam Supt",null,1,"103","LOC","O","0","Local Government                   ","LOC-Local Government    ",null,1,"300040","300","040","9000","Program Support                    ","9000-Program Support     "]
[1,{"$f":"LEFT(Table_clallam_Oversight_ActiveFunds[[#This Row],[Agency]],3)","v":"013"},"013-Jt Trans Committee","218-1 Multimodal Acct-State",{"$f":"LEFT(Table_clallam_Oversight_ActiveFunds[[#This Row],[Fund]],5)","v":"218-1"},null,"035",6,"035-Office of the State Actuary        ","035","001-C","001-C General Fund-Medicaid",null,1,"107","CBH","O","0","Community Behavioral Health        ","CBH-Comm Behavior Hlth  "]
[1,{"$f":"LEFT(Table_clallam_Oversight_ActiveFunds[[#This Row],[Agency]],3)","v":"014"},"014-Leg Audit & Review","001-1 General Fund-State",{"$f":"LEFT(Table_clallam_Oversight_ActiveFunds[[#This Row],[Fund]],5)","v":"001-1"},null,"036",7,"036-State Legislative Labor Relations  ","036","001-D","001-D General Fund-TANF",null,1,"107","HBE","O","0","Health Benefit Exchange            ","HBE-Health Benefit Exch "]
[1,{"$f":"LEFT(Table_clallam_Oversight_ActiveFunds[[#This Row],[Agency]],3)","v":"014"},"014-Leg Audit & Review","553-1 Perf Audits of Govt-State",{"$f":"LEFT(Table_clallam_Oversight_ActiveFunds[[#This Row],[Fund]],5)","v":"553-1"},null,"037",8,"037-Office of Legislative Support Svcs ","037","001-H","001-H General Fund-ARPA",null,1,"107","OTH","O","0","Other                              ","OTH-Other               "]
[1,{"$f":"LEFT(Table_clallam_Oversight_ActiveFunds[[#This Row],[Agency]],3)","v":"014"},"014-Leg Audit & Review","099-1 PS Cap Construction-State",{"$f":"LEFT(Table_clallam_Oversight_ActiveFunds[[#This Row],[Fund]],5)","v":"099-1"},null,"038",9,"038-Joint Legislative Systems Comm     ","038","001-W","001-W General Fund-Oth COVID",null,1,"107","PEB","O","0","Employee Benefits                  ","PEB-Employee Benefits   "]
[1,{"$f":"LEFT(Table_clallam_Oversight_ActiveFunds[[#This Row],[Agency]],3)","v":"014"},"014-Leg Audit & Review","218-1 Multimodal Acct-State",{"$f":"LEFT(Table_clallam_Oversight_ActiveFunds[[#This Row],[Fund]],5)","v":"218-1"},null,"040",10,"040-Statute Law Committee              ","040","001-X","001-X General Fund-CRF App",null,1,"107","SEB","O","0","School Employee Benefits Board     ","SEB-Schl Empl Benefits  "]
[1,{"$f":"LEFT(Table_clallam_Oversight_ActiveFunds[[#This Row],[Agency]],3)","v":"020"},"020-LEAP Committee","553-1 Perf Audits of Govt-State",{"$f":"LEFT(Table_clallam_Oversight_ActiveFunds[[#This Row],[Fund]],5)","v":"553-1"},null,"045",11,"045-Supreme Court                      ","045","001-Y","001-Y General Fund-Oth UAR",null,1,"225","90C","O","0","Capital                            ","90C-Capital             "]
[1,{"$f":"LEFT(Table_clallam_Oversight_ActiveFunds[[#This Row],[Agency]],3)","v":"020"},"020-LEAP Committee","108-1 Motor Vehicle Acct-State",{"$f":"LEFT(Table_clallam_Oversight_ActiveFunds[[#This Row],[Fund]],5)","v":"108-1"},null,"048",12,"048-Court of Appeals                   ","048","001-Z","001-Z General Fund-CRRSA",null,1,"225","OPR","O","0","Operating                          ","OPR-Operating           "]
[1,{"$f":"LEFT(Table_clallam_Oversight_ActiveFunds[[#This Row],[Agency]],3)","v":"035"},"035-State Actuary","001-1 General Fund-State",{"$f":"LEFT(Table_clallam_Oversight_ActiveFunds[[#This Row],[Fund]],5)","v":"001-1"},null,"050",13,"050-Commission on Judicial Conduct     ","050","002-1","002-1 Hospital Data Collec-State",null,1,"300","030","O","0","Mental Health                      ","030-Mental Health       "]
[1,{"$f":"LEFT(Table_clallam_Oversight_ActiveFunds[[#This Row],[Agency]],3)","v":"035"},"035-State Actuary","418-1 St Hlth Care Admn Ac-State",{"$f":"LEFT(Table_clallam_Oversight_ActiveFunds[[#This Row],[Fund]],5)","v":"418-1"},null,"055",14,"055-Administrative Office of the Courts","055","003-1","003-1 Architects' License-State",null,1,"300","040","O","0","Developmental Disabilities         ","040-Develop Disabilities"]
[1,{"$f":"LEFT(Table_clallam_Oversight_ActiveFunds[[#This Row],[Agency]],3)","v":"035"},"035-State Actuary","492-1 School Employees' In-State",{"$f":"LEFT(Table_clallam_Oversight_ActiveFunds[[#This Row],[Fund]],5)","v":"492-1"},null,"056",15,"056-Office of Public Defense           ","056","006-1","006-1 Public Records Effic-State",null,1,"300","050","O","0","Long-Term Care                     ","050-Long-Term Care      "]
[1,{"$f":"LEFT(Table_clallam_Oversight_ActiveFunds[[#This Row],[Agency]],3)","v":"035"},"035-State Actuary","600-1 Retirmnt Sys Expense-State",{"$f":"LEFT(Table_clallam_Oversight_ActiveFunds[[#This Row],[Fund]],5)","v":"600-1"},null,"057",16,"057-Office of Civil Legal Aid          ","057","007-1","007-1 Winter Recreation-State",null,1,"300","060","O","0","Economic Services Administration   ","060-Economic Svcs Admin "]
[1,{"$f":"LEFT(Table_clallam_Oversight_ActiveFunds[[#This Row],[Agency]],3)","v":"036"},"036-St Leg Labor Rel","001-1 General Fund-State",{"$f":"LEFT(Table_clallam_Oversight_ActiveFunds[[#This Row],[Fund]],5)","v":"001-1"},null,"075",17,"075-Office of the Governor             ","075","014-1","014-1 Forest Development-State",null,1,"300","100","O","0","Vocational Rehabilitation          ","100-Vocational Rehab    "]
[1,{"$f":"LEFT(Table_clallam_Oversight_ActiveFunds[[#This Row],[Agency]],3)","v":"037"},"037-Leg Support Services","001-1 General Fund-State",{"$f":"LEFT(Table_clallam_Oversight_ActiveFunds[[#This Row],[Fund]],5)","v":"001-1"},null,"080",18,"080-Office of the Lieutenant Governor  ","080","018-1","018-1 Millersylvania Park-State",null,1,"300","110","O","0","Administration/Support Svcs        ","110-Admin/Suppt Svcs    "]
[1,{"$f":"LEFT(Table_clallam_Oversight_ActiveFunds[[#This Row],[Agency]],3)","v":"037"},"037-Leg Support Services","442-6 Leg Gift Center Acct-Non-Appr",{"$f":"LEFT(Table_clallam_Oversight_ActiveFunds[[#This Row],[Fund]],5)","v":"442-6"},null,"082",19,"082-Public Disclosure Commission       ","082","01B-1","01B-1 ORV/NonHiwy Veh Acct-State",null,1,"300","135","O","0","Special Commitment Center          ","135-Special Commitment  "]
[1,{"$f":"LEFT(Table_clallam_Oversight_ActiveFunds[[#This Row],[Agency]],3)","v":"038"},"038-Joint Leg Syst Comm","001-1 General Fund-State",{"$f":"LEFT(Table_clallam_Oversight_ActiveFunds[[#This Row],[Fund]],5)","v":"001-1"},null,"083",20,"083-Washington State Leadership Board  ","083","01F-6","01F-6 Crime Victims Compen-Non-Appr",null,1,"300","145","O","0","Payments to Other Agencies         ","145-Payments to Othr Agy"]
[1,{"$f":"LEFT(Table_clallam_Oversight_ActiveFunds[[#This Row],[Agency]],3)","v":"040"},"040-Statute Law Comm","001-1 General Fund-State",{"$f":"LEFT(Table_clallam_Oversight_ActiveFunds[[#This Row],[Fund]],5)","v":"001-1"},null,"085",21,"085-Office of the Secretary of State   ","085","01M-1","01M-1 Snowmobile Account-State",null,1,"305","010","O","0","Headquarters                       ","010-Headquarters        "]
[1,{"$f":"LEFT(Table_clallam_Oversight_ActiveFunds[[#This Row],[Agency]],3)","v":"040"},"040-Statute Law Comm","197-6 Statute Law Comm Pub-Non-Appr",{"$f":"LEFT(Table_clallam_Oversight_ActiveFunds[[#This Row],[Fund]],5)","v":"197-6"},null,"086",22,"086-Governor's Office of Indian Affairs","086","024-1","024-1 Profess Engineers'-State",null,1,"305","020","O","0","Field Services                     ","020-Field Services      "]
[1,{"$f":"LEFT(Table_clallam_Oversight_ActiveFunds[[#This Row],[Agency]],3)","v":"045"},"045-Supreme Court","001-1 General Fund-State",{"$f":"LEFT(Table_clallam_Oversight_ActiveFunds[[#This Row],[Fund]],5)","v":"001-1"},null,"087",23,"087-Asian-Pacific-American Affrs       ","087","025-1","025-1 Pilotage Account-State",null,1,"305","035","O","0","State Veterans Homes               ","035-State Vets Homes    "]
[1,{"$f":"LEFT(Table_clallam_Oversight_ActiveFunds[[#This Row],[Agency]],3)","v":"046"},"046-State Law Library","001-1 General Fund-State",{"$f":"LEFT(Table_clallam_Oversight_ActiveFunds[[#This Row],[Fund]],5)","v":"001-1"},null,"090",24,"090-Office of the State Treasurer      ","090","026-1","026-1 Real Estate Cmsn-State",null,1,"305","045","O","0","Veteran's Cemetery Services        ","045-Vets Cemetery Servs "]
[1,{"$f":"LEFT(Table_clallam_Oversight_ActiveFunds[[#This Row],[Agency]],3)","v":"048"},"048-Court of Appeals","001-1 General Fund-State",{"$f":"LEFT(Table_clallam_Oversight_ActiveFunds[[#This Row],[Fund]],5)","v":"001-1"},null,"095",25,"095-Office of the State Auditor        ","095","027-1","027-1 Reclamation Acct-State",null,1,"307","010","O","0","Children and Families Services     ","010-Children & Families "]
[1,{"$f":"LEFT(Table_clallam_Oversight_ActiveFunds[[#This Row],[Agency]],3)","v":"050"},"050-Judicial Conduct","001-1 General Fund-State",{"$f":"LEFT(Table_clallam_Oversight_ActiveFunds[[#This Row],[Fund]],5)","v":"001-1"},null,"099",26,"099-Comm Salaries for Elected Officials","099","02A-1","02A-1 Surveys & Maps Acct-State",null,1,"307","020","O","0","Juvenile Rehabilitation            ","020-Juvenile Rehab      "]
[1,{"$f":"LEFT(Table_clallam_Oversight_ActiveFunds[[#This Row],[Agency]],3)","v":"055"},"055-Admin Office Courts","001-1 General Fund-State",{"$f":"LEFT(Table_clallam_Oversight_ActiveFunds[[#This Row],[Fund]],5)","v":"001-1"},null,"100",27,"100-Office of the Attorney General     ","100","02G-1","02G-1 Health Prfessns Acct-State",null,1,"307","030","O","0","Early Learning                     ","030-Early Learning      "]
[1,{"$f":"LEFT(Table_clallam_Oversight_ActiveFunds[[#This Row],[Agency]],3)","v":"055"},"055-Admin Office Courts","001-2 General Fund-Federal",{"$f":"LEFT(Table_clallam_Oversight_ActiveFunds[[#This Row],[Fund]],5)","v":"001-2"},null,"101",28,"101-Caseload Forecast Council          ","101","02H-6","02H-6 Business Enterprises-Non-Appr",null,1,"307","090","O","0","Program Support                    ","090-Program Support     "]
[1,{"$f":"LEFT(Table_clallam_Oversight_ActiveFunds[[#This Row],[Agency]],3)","v":"055"},"055-Admin Office Courts","001-7 General Fund-Local",{"$f":"LEFT(Table_clallam_Oversight_ActiveFunds[[#This Row],[Fund]],5)","v":"001-7"},null,"102",29,"102-Dept of Financial Institutions     ","102","02J-1","02J-1 CPA Account-State",null,1,"310","100","O","0","Admin & Support Services           ","100-Admin & Suppt Svcs  "]
[1,{"$f":"LEFT(Table_clallam_Oversight_ActiveFunds[[#This Row],[Agency]],3)","v":"055"},"055-Admin Office Courts","001-X General Fund-CRF App",{"$f":"LEFT(Table_clallam_Oversight_ActiveFunds[[#This Row],[Fund]],5)","v":"001-X"},null,"103",30,"103-Department of Commerce             ","103","02K-1","02K-1 Death Investigations-State",null,1,"310","200","O","0","Correctional Operations            ","200-Correctional Oper   "]
[1,{"$f":"LEFT(Table_clallam_Oversight_ActiveFunds[[#This Row],[Agency]],3)","v":"055"},"055-Admin Office Courts","16A-1 Judicial Stabil Trst-State",{"$f":"LEFT(Table_clallam_Oversight_ActiveFunds[[#This Row],[Fund]],5)","v":"16A-1"},null,"104",31,"104-Economic & Revenue Forecast Council","104","02M-1","02M-1 Essential Rail Asst-State",null,1,"310","300","O","0","Community Supervision              ","300-Community Supervsn  "]
[1,{"$f":"LEFT(Table_clallam_Oversight_ActiveFunds[[#This Row],[Agency]],3)","v":"055"},"055-Admin Office Courts","543-1 Judicial Info System-State",{"$f":"LEFT(Table_clallam_Oversight_ActiveFunds[[#This Row],[Fund]],5)","v":"543-1"},null,"105",32,"105-Office of Financial Management     ","105","02P-1","02P-1 Flood Control Assist-State",null,1,"310","400","O","0","Correctional Industries            ","400-Correctional Indust "]
[1,{"$f":"LEFT(Table_clallam_Oversight_ActiveFunds[[#This Row],[Agency]],3)","v":"056"},"056-Public Defense","001-1 General Fund-State",{"$f":"LEFT(Table_clallam_Oversight_ActiveFunds[[#This Row],[Fund]],5)","v":"001-1"},null,"107",33,"107-WA State Health Care Authority     ",{"$f":"LEFT(I36,3)","v":"107"},"02R-1","02R-1 Aquatic Lands Acct-State",null,1,"310","500","O","0","Health Care Services               ","500-Health Care Services"]
[1,{"$f":"LEFT(Table_clallam_Oversight_ActiveFunds[[#This Row],[Agency]],3)","v":"056"},"056-Public Defense","001-2 General Fund-Federal",{"$f":"LEFT(Table_clallam_Oversight_ActiveFunds[[#This Row],[Fund]],5)","v":"001-2"},null,"110",34,"110-Office of Administrative Hearings  ","110","02W-1","02W-1 Timber Tax Distr Act-State",null,1,"310","600","O","0","Interagency Payments               ","600-Interagency Payments"]
[1,{"$f":"LEFT(Table_clallam_Oversight_ActiveFunds[[#This Row],[Agency]],3)","v":"056"},"056-Public Defense","001-7 General Fund-Local",{"$f":"LEFT(Table_clallam_Oversight_ActiveFunds[[#This Row],[Fund]],5)","v":"001-7"},null,"116",35,"116-State Lottery Commission           ","116","030-6","030-6 Land Cont Forst Fire-Non-Appr",null,1,"310","700","O","0","Offender Change                    ","700-Offender Change     "]
[1,{"$f":"LEFT(Table_clallam_Oversight_ActiveFunds[[#This Row],[Agency]],3)","v":"056"},"056-Public Defense","16A-1 Judicial Stabil Trst-State",{"$f":"LEFT(Table_clallam_Oversight_ActiveFunds[[#This Row],[Fund]],5)","v":"16A-1"},null,"117",36,"117-Washington State Gambling Comm     ","117","031-1","031-1 Invest Bd Expense Ac-State",null,1,"340","PCA","O","0","Policy & Research Coordination     ","PCA-Policy & Research   "]
[1,{"$f":"LEFT(Table_clallam_Oversight_ActiveFunds[[#This Row],[Agency]],3)","v":"057"},"057-Civil Legal Aid","001-1 General Fund-State",{"$f":"LEFT(Table_clallam_Oversight_ActiveFunds[[#This Row],[Fund]],5)","v":"001-1"},null,"118",37,"118-WA State Comm on Hispanic Affairs  ","118","032-1","032-1 Emergency Water Proj-State",null,1,"340","SFA","O","0","Student Financial Assistance       ","SFA-Student Fin Assist  "]
{"$rows_left_out":823}