{"text_format":"1","workbook":"xlsx","n_sheets":4,"sheets":["Information","FundSplits","FundSplitsDB","ActiveFunds"],"not_rendered":{"charts":0,"images":0,"macros":1,"external_links":2,"defined_names":40,"comments":0,"pivot_tables":0},"unopened":[],"bounds":{"document_bytes":16777216,"sheet_cells":100000,"rows_first":2000,"rows_last":500,"rows_between":2000,"halvings":0,"cell_chars":16384,"cell_head_chars":4096},"cells_cut":0,"cells_raw":0,"read":"whole","date_system":"1900"}

{"sheet":"Information","index":0,"n_rows":14,"n_cols":1,"rows_kept":14,"cut":false,"hidden":false,"merged":[]}
[]
["Central Service Fund Splits "]
["Information and Instructions"]
[]
["1.  Fund splits currently on the sheet are the final fund splits from the 2022 Supplemental model"]
["2.  To view a specific agencies splits choose the agency in the drop down box"]
["3.  The top choice in the drop down box will be to view all agencies."]
["4.  You will only be able to update, edit or delete a fund split at the agency level.  If all agencies are chosen it is view only and edits cannot be made."]
["5.  Agencies fund splits begin on row 10.  You will be able to delete or clear any row starting at row 10 and below.  Unlike the previous fund split sheet deleting is allowed"]
["6.  Once you have selected an agency there will be drop down selections that needs to be filled out in columns F, G, H, and I.  These will be smart lists that only apply to the specific agency."]
["7.  Each column starting in column J through column S will need to have a fund split that equals 100% for the agency.  All columns will need to be filled unlike the previous sheet where blanks were ok.  "]
["    This will simplyfy formulas in the model.  If an agency has only one split for all services then you will just need to copy the split to all columns."]
["8.  Program and Subprogram detail is only needed for certain agencies.  The drop down will display a blank if the agency does not need program/subprogram detail."]
["9.  Please send updated fund split information to your assigned budget assistant with a copy to the central service model budget assistant."]

{"sheet":"FundSplits","index":1,"n_rows":372,"n_cols":19,"rows_kept":372,"cut":false,"hidden":false,"merged":[]}
[1,{"$f":"LEFT(VLOOKUP(A1,ActiveFunds!$G$4:$H$150,2,0),3)","v":"All"},null,{"$f":"VLOOKUP(A1,ActiveFunds!$G$4:$H$150,2,0)","v":"All Agencies"},null,"Central Service Fund Splits"]
[null,"DuplicateCheck"]
[]
[null,null,null,null,null,null,null,null,{"$f":"IF(AND(LEFT(F10,3)=\"300\",LEFT(G10,3)=\"030\"),$AA$5:$AA$8,IF(AND(LEFT(F10,3)=\"300\",LEFT(G10,3)=\"040\"),$AA$9:$AA$11,\"\"))","v":""}]
[]
[{"$f":"LEFT(F6,3)","v":""},{"$f":"TRIM(LEFT(G6,3))","v":""},{"$f":"TRIM(LEFT(H6,4))","v":""},{"$f":"LEFT(I6,3)","v":""},{"$f":"MID(I6,5,1)","v":""},null,null,{"$f":"IF(AND(LEFT(F10,3)=\"300\",LEFT(G10,3)=\"030\"),ActiveFunds!$Z$5:$Z$8,IF(AND(LEFT(F10,3)=\"300\",LEFT(G102,3)=\"040\"),ActiveFunds!$Z$9:$Z$12,\"\"))","v":""},null,"All Columns by Agency must equal 100%"]
["Agency Code","Program Code","Subprogram Code","Account","AppType","Agency","Program","Subprogram (only used for DSHS in Program 030 and 040)","Account and Approp Title","Auditor","AttGen","OAH","Facilities & Services Only","CTS","Debt Services ","Workers' Comp","All Other","Risk Mgmt Division","Self Insurance"]
[null,null,null,null,null,"Percent Totals (only applies when one agency chosen)",null,null,null,{"$f":"IF(AgyChoice=1,\"\",SUM(J9:J980))","v":""},"","","","","","","","",""]
["011","","","001","1","011-House of Representatives",null,null,"001-1 General Fund-State",1,1,1,1,1,1,1,1,1,1]
["012","","","001","1","012-Senate",null,null,"001-1 General Fund-State",1,1,1,1,1,1,1,1,1,1]
["013","","","108","1","013-Joint Transportation Committee",null,null,"108-1 Motor Vehicle Account-State",1,1,1,1,1,1,1,1,1,1]
["014","","","553","1","014-Jt Leg Audit & Review Committee",null,null,"553-1 Performance Audits of Govt Acct-State",1,1,1,1,1,1,1,1,1,1]
["020","","","553","1","020-LEAP Committee",null,null,"553-1 Performance Audits of Govt Acct-State",1,1,1,1,1,1,1,1,1,1]
["035","","","600","1","035-Office of the State Actuary",null,null,"600-1 Dept of Retirement Systems Expense-State",1,1,1,1,1,1,1,1,1,1]
["036","","","001","1","036-State Legislative Labor Relations",null,null,"001-1 General Fund-State",1,1,1,1,1,1,1,1,1,1]
["037","","","001","1","037-Office of Legislative Support Svcs",null,null,"001-1 General Fund-State",1,1,1,1,1,1,1,1,1,1]
["038","","","001","1","038-Joint Legislative Systems Comm",null,null,"001-1 General Fund-State",1,1,1,1,1,1,1,1,1,1]
["040","","","001","1","040-Statute Law Committee",null,null,"001-1 General Fund-State",0.8,0.8,0.8,0.8,0.8,0.8,0.8,0.8,0.8,0.8]
["040","","","197","6","040-Statute Law Committee",null,null,"197-6 Statute Law Committee Publications-Non-Appropriated",0.2,0.2,0.2,0.2,0.2,0.2,0.2,0.2,0.2,0.2]
["045","","","001","1","045-Supreme Court",null,null,"001-1 General Fund-State",1,1,1,1,1,1,1,1,1,1]
["046","","","001","1","046-State Law Library",null,null,"001-1 General Fund-State",1,1,1,1,1,1,1,1,1,1]
["048","","","001","1","048-Court of Appeals",null,null,"001-1 General Fund-State",1,1,1,1,1,1,1,1,1,1]
["050","","","001","1","050-Commission on Judicial Conduct",null,null,"001-1 General Fund-State",1,1,1,1,1,1,1,1,1,1]
["055","","","001","1","055-Administrative Office of the Courts",null,null,"001-1 General Fund-State",1,1,1,1,1,1,1,1,1,1]
["056","","","16A","1","056-Office of Public Defense",null,null,"16A-1 Judicial Stabilization Trust Accoun-State",1,1,1,1,1,1,1,1,1,1]
["057","","","001","1","057-Office of Civil Legal Aid",null,null,"001-1 General Fund-State",1,1,1,1,1,1,1,1,1,1]
["075","","","001","1","075-Office of the Governor",null,null,"001-1 General Fund-State",1,1,1,1,1,1,1,1,1,1]
["080","","","001","1","080-Office of the Lieutenant Governor",null,null,"001-1 General Fund-State",1,1,1,1,1,1,1,1,1,1]
["082","","","001","1","082-Public Disclosure Commission",null,null,"001-1 General Fund-State",1,1,1,1,1,1,1,1,1,1]
["083","","","26H","1","083-Washington State Leadership Board",null,null,"26H-1 WA St Leadership Board-State",1,1,1,1,1,1,1,1,1,1]
{"$rows_left_out":343}
{"sheet":"FundSplitsDB","index":2,"n_rows":367,"n_cols":22,"rows_kept":367,"cut":false,"hidden":true,"merged":[]}
["Agency Code","Program Code","SubprogramCode","Account","AppType","Agency","Program","Subprogram (only used for DSHS in Program 030 and 040)","Account and Approp Title","Auditor","AttGen","OAH","Facilities & Services Only","CTS","Debt Services ","Workers' Comp","All Other","Risk Mgmt Division","Self Insurance",null,"Check Agency has Fund Splits",{"$f":"COUNTIF(A:A,AgyCode)","v":0}]
["011","","","001","1","011-House of Representatives",null,null,"001-1 General Fund-State",1,1,1,1,1,1,1,1,1,1]
["012","","","001","1","012-Senate",null,null,"001-1 General Fund-State",1,1,1,1,1,1,1,1,1,1]
["013","","","108","1","013-Joint Transportation Committee",null,null,"108-1 Motor Vehicle Account-State",1,1,1,1,1,1,1,1,1,1]
["014","","","553","1","014-Jt Leg Audit & Review Committee",null,null,"553-1 Performance Audits of Govt Acct-State",1,1,1,1,1,1,1,1,1,1]
["020","","","553","1","020-LEAP Committee",null,null,"553-1 Performance Audits of Govt Acct-State",1,1,1,1,1,1,1,1,1,1]
["035","","","600","1","035-Office of the State Actuary",null,null,"600-1 Dept of Retirement Systems Expense-State",1,1,1,1,1,1,1,1,1,1]
["036","","","001","1","036-State Legislative Labor Relations",null,null,"001-1 General Fund-State",1,1,1,1,1,1,1,1,1,1]
["037","","","001","1","037-Office of Legislative Support Svcs",null,null,"001-1 General Fund-State",1,1,1,1,1,1,1,1,1,1]
["038","","","001","1","038-Joint Legislative Systems Comm",null,null,"001-1 General Fund-State",1,1,1,1,1,1,1,1,1,1]
["040","","","001","1","040-Statute Law Committee",null,null,"001-1 General Fund-State",0.8,0.8,0.8,0.8,0.8,0.8,0.8,0.8,0.8,0.8]
["040","","","197","6","040-Statute Law Committee",null,null,"197-6 Statute Law Committee Publications-Non-Appropriated",0.2,0.2,0.2,0.2,0.2,0.2,0.2,0.2,0.2,0.2]
["045","","","001","1","045-Supreme Court",null,null,"001-1 General Fund-State",1,1,1,1,1,1,1,1,1,1]
["046","","","001","1","046-State Law Library",null,null,"001-1 General Fund-State",1,1,1,1,1,1,1,1,1,1]
["048","","","001","1","048-Court of Appeals",null,null,"001-1 General Fund-State",1,1,1,1,1,1,1,1,1,1]
["050","","","001","1","050-Commission on Judicial Conduct",null,null,"001-1 General Fund-State",1,1,1,1,1,1,1,1,1,1]
["055","","","001","1","055-Administrative Office of the Courts",null,null,"001-1 General Fund-State",1,1,1,1,1,1,1,1,1,1]
["056","","","16A","1","056-Office of Public Defense",null,null,"16A-1 Judicial Stabilization Trust Accoun-State",1,1,1,1,1,1,1,1,1,1]
["057","","","001","1","057-Office of Civil Legal Aid",null,null,"001-1 General Fund-State",1,1,1,1,1,1,1,1,1,1]
["075","","","001","1","075-Office of the Governor",null,null,"001-1 General Fund-State",1,1,1,1,1,1,1,1,1,1]
["080","","","001","1","080-Office of the Lieutenant Governor",null,null,"001-1 General Fund-State",1,1,1,1,1,1,1,1,1,1]
["082","","","001","1","082-Public Disclosure Commission",null,null,"001-1 General Fund-State",1,1,1,1,1,1,1,1,1,1]
["083","","","26H","1","083-Washington State Leadership Board",null,null,"26H-1 WA St Leadership Board-State",1,1,1,1,1,1,1,1,1,1]
["085","","","001","1","085-Office of the Secretary of State",null,null,"001-1 General Fund-State",0.41,0.41,0.41,0.41,0.41,0.41,0.41,0.41,0.41,0.41]
["085","","","006","1","085-Office of the Secretary of State",null,null,"006-1 Public Records Effic/Presrv/Access-State",0.11,0.11,0.11,0.11,0.11,0.11,0.11,0.11,0.11,0.11]
["085","","","14E","1","085-Office of the Secretary of State",null,null,"14E-1 WA State Heritage Center Account-State",0.13,0.13,0.13,0.13,0.13,0.13,0.13,0.13,0.13,0.13]
["085","","","407","6","085-Office of the Secretary of State",null,null,"407-6 Secretary of State's Revolving Acct-Non-Appropriated",0.22,0.22,0.22,0.22,0.22,0.22,0.22,0.22,0.22,0.22]
["085","","","441","1","085-Office of the Secretary of State",null,null,"441-1 Local Government Archives Account-State",0.13,0.13,0.13,0.13,0.13,0.13,0.13,0.13,0.13,0.13]
["086","","","001","1","086-Governor's Office of Indian Affairs",null,null,"001-1 General Fund-State",1,1,1,1,1,1,1,1,1,1]
["087","","","001","1","087-Asian-Pacific-American Affrs",null,null,"001-1 General Fund-State",1,1,1,1,1,1,1,1,1,1]
{"$rows_left_out":338}
{"sheet":"ActiveFunds","index":3,"n_rows":862,"n_cols":27,"rows_kept":862,"cut":false,"hidden":true,"merged":[]}
[null,null,null,null,null,null,null,"001-2 General Fund-Federal",null,{"$f":"COUNTIF(AgencyFund,Agency)","v":0},null,null,"",{"$f":"IF(pgmcheck=1,OFFSET(AgencyProgram,MATCH((AgyCode),AgencyProgram,0)-1,4,COUNTIF(AgencyProgram,AgyCode)),PgmList)","v":{"$error":"#VALUE!"}},null,null,null,"IF(AgyChoice=1,FundList,OFFSET(AgencyFund,MATCH((Agency),AgencyFund,0)-1,1,COUNTIF(AgencyFund,Agency)))"]
[null,"AgencyFund Table",null,null,null,null,null,null,null,null,"Distinct Fund List",null,null,"Programcheck",null,{"$f":"IFERROR(INDEX($M$4:$M$67,MATCH(AgyCode,Table_clallam_Titles_Entity[Agency],0)),0)","v":0},null,{"$f":"IF(pgmcheck=1,OFFSET(AgencyProgram,MATCH((AgyCode),AgencyProgram,0)-1,4,COUNTIF(AgencyProgram,AgyCode)),OFFSET(pgmcheck,0,1))","v":0},{"$f":"IF(pgmcheck=1,OFFSET(AgencyProgram,MATCH((AgyCode),AgencyProgram,0)-1,4,COUNTIF(AgencyProgram,AgyCode)),PgmList)","v":{"$error":"#VALUE!"}},null,null,null,null,"IF(pgmcheck=1,OFFSET(AgencyProgram,MATCH((AgyCode),AgencyProgram,0)-1,4,COUNTIF(AgencyProgram,AgyCode)),$A$2)"]
[null,"Agency","Fund","Column1",null,null,null,"Agency",null,null,"Fund",null,null,"Agency","ProgramCode","BudgetType","SummFlag","ProgramTitle60","Program2"]
[null,"011-House of Reps","001-1 General Fund-State",{"$f":"LEFT(Table_clallam_Oversight_ActiveFunds[[#This Row],[Fund]],5)","v":"001-1"},null,"All",1,"All Agencies",{"$f":"LEFT(H4,3)","v":"All"},{"$f":"MID(K4,1,5)","v":"001-0"},"001-0 General Fund-Fed Grnt",null,1,"107","HBE","O",false,"Health Care Auth-Health Benefit Exchange",{"$f":"[2]ActiveFunds!$O4&\"-\"&[2]ActiveFunds!$R4","v":"HBE-Health Care Auth-Health Benefit Exchange"},null,{"$f":"N4&O4","v":"107HBE"},{"$f":"O4&\"-\"&R4","v":"HBE-Health Care Auth-Health Benefit Exchange"},null,"Agency","Program","Subprogram","AgencyProgram"]
[null,"011-House of Reps","108-1 Motor Vehicle Acct-State",{"$f":"LEFT(Table_clallam_Oversight_ActiveFunds[[#This Row],[Fund]],5)","v":"108-1"},null,"011",2,"011-House of Reps","011",{"$f":"MID(K5,1,5)","v":"001-1"},"001-1 General Fund-State",null,1,"107","OTH","O",false,"Health Care Auth-Other",{"$f":"[2]ActiveFunds!$O5&\"-\"&[2]ActiveFunds!$R5","v":"OTH-Health Care Auth-Other"},null,{"$f":"N5&O5","v":"107OTH"},{"$f":"O5&\"-\"&R5","v":"OTH-Health Care Auth-Other"},null,"300","030","1000-Community Services/RSN             ","300030"]
[null,"012-Senate","001-1 General Fund-State",{"$f":"LEFT(Table_clallam_Oversight_ActiveFunds[[#This Row],[Fund]],5)","v":"001-1"},null,"012",3,"012-Senate","012","001-2","001-2 General Fund-Federal",null,1,"107","PEB","O",false,"Health Care Auth-Employee Benefits",{"$f":"[2]ActiveFunds!$O6&\"-\"&[2]ActiveFunds!$R6","v":"PEB-Health Care Auth-Employee Benefits"},null,"107PEB","PEB-Health Care Auth-Employee Benefits",null,"300","030","2000-State Facility Services            ","300030"]
[null,"012-Senate","108-1 Motor Vehicle Acct-State",{"$f":"LEFT(Table_clallam_Oversight_ActiveFunds[[#This Row],[Fund]],5)","v":"108-1"},null,"013",4,"013-Jt Trans Committee","013","001-7","001-7 General Fund-Local",null,1,"107","SEB","O",false,"School Employee Benefits Board",{"$f":"[2]ActiveFunds!$O7&\"-\"&[2]ActiveFunds!$R7","v":"SEB-School Employee Benefits Board"},null,"107SEB","SEB-School Employee Benefits Board",null,"300","030","8000-Special Projects                   ","300030"]
[null,"013-Jt Trans Committee","108-1 Motor Vehicle Acct-State",{"$f":"LEFT(Table_clallam_Oversight_ActiveFunds[[#This Row],[Fund]],5)","v":"108-1"},null,"014",5,"014-Leg Audit & Review","014","001-A","001-A General Fund-Fam Supt",null,1,"300","010","O",false,"Children & Family Services",{"$f":"[2]ActiveFunds!$O8&\"-\"&[2]ActiveFunds!$R8","v":"010-Children & Family Services"},null,"300010","010-Children & Family Services",null,"300","030","9000-Program Support                    ","300030"]
[null,"013-Jt Trans Committee","218-1 Multimodal Acct-State",{"$f":"LEFT(Table_clallam_Oversight_ActiveFunds[[#This Row],[Fund]],5)","v":"218-1"},null,"020",6,"020-LEAP Committee","020","001-C","001-C General Fund-Medicaid",null,1,"300","020","O",false,"Juvenile Rehabilitation",{"$f":"[2]ActiveFunds!$O9&\"-\"&[2]ActiveFunds!$R9","v":"020-Juvenile Rehabilitation"},null,"300020","020-Juvenile Rehabilitation",null,"300","040","1000-Community Services                 ","300040"]
[null,"014-Leg Audit & Review","001-1 General Fund-State",{"$f":"LEFT(Table_clallam_Oversight_ActiveFunds[[#This Row],[Fund]],5)","v":"001-1"},null,"035",7,"035-State Actuary","035","001-D","001-D General Fund-TANF",null,1,"300","030","O",true,"Mental Health",{"$f":"[2]ActiveFunds!$O10&\"-\"&[2]ActiveFunds!$R10","v":"030-Mental Health"},null,"300030","030-Mental Health",null,"300","040","2000-Residential Habilitation Services  ","300040"]
[null,"014-Leg Audit & Review","553-1 Perf Audits of Govt-State",{"$f":"LEFT(Table_clallam_Oversight_ActiveFunds[[#This Row],[Fund]],5)","v":"553-1"},null,"037",8,"036-St Leg Labor Rel","036","001-H","001-H General Fund-ARPA",null,1,"300","040","O",true,"Developmental Disabilities",{"$f":"[2]ActiveFunds!$O11&\"-\"&[2]ActiveFunds!$R11","v":"040-Developmental Disabilities"},null,"300040","040-Developmental Disabilities",null,"300","040","8000-Special Projects                   ","300040"]
[null,"014-Leg Audit & Review","099-1 PS Cap Construction-State",{"$f":"LEFT(Table_clallam_Oversight_ActiveFunds[[#This Row],[Fund]],5)","v":"099-1"},null,"038",9,"037-Leg Support Services","037","001-W","001-W General Fund-Oth COVID",null,1,"300","050","O",false,"Long-Term Care Services",{"$f":"[2]ActiveFunds!$O12&\"-\"&[2]ActiveFunds!$R12","v":"050-Long-Term Care Services"},null,"300050","050-Long-Term Care Services",null,"300","040","9000-Program Support                    ","300040"]
[null,"014-Leg Audit & Review","218-1 Multimodal Acct-State",{"$f":"LEFT(Table_clallam_Oversight_ActiveFunds[[#This Row],[Fund]],5)","v":"218-1"},null,"040",10,"038-Joint Leg Syst Comm","038","001-X","001-X General Fund-CRF App",null,1,"300","060","O",false,"Economic Services Administration",{"$f":"[2]ActiveFunds!$O13&\"-\"&[2]ActiveFunds!$R13","v":"060-Economic Services Administration"},null,"300060","060-Economic Services Administration"]
[null,"020-LEAP Committee","553-1 Perf Audits of Govt-State",{"$f":"LEFT(Table_clallam_Oversight_ActiveFunds[[#This Row],[Fund]],5)","v":"553-1"},null,"045",11,"040-Statute Law Comm","040","001-Y","001-Y General Fund-Oth UAR",null,1,"300","070","O",false,"Alcohol & Substance Abuse",{"$f":"[2]ActiveFunds!$O14&\"-\"&[2]ActiveFunds!$R14","v":"070-Alcohol & Substance Abuse"},null,"300070","070-Alcohol & Substance Abuse"]
[null,"020-LEAP Committee","108-1 Motor Vehicle Acct-State",{"$f":"LEFT(Table_clallam_Oversight_ActiveFunds[[#This Row],[Fund]],5)","v":"108-1"},null,"046",12,"045-Supreme Court","045","001-Z","001-Z General Fund-CRRSA",null,1,"300","100","O",false,"Vocational Rehabilitation",{"$f":"[2]ActiveFunds!$O15&\"-\"&[2]ActiveFunds!$R15","v":"100-Vocational Rehabilitation"},null,"300100","100-Vocational Rehabilitation",null,"9000-Program Support                    "]
[null,"035-State Actuary","001-1 General Fund-State",{"$f":"LEFT(Table_clallam_Oversight_ActiveFunds[[#This Row],[Fund]],5)","v":"001-1"},null,"048",13,"046-State Law Library","046","002-1","002-1 Hospital Data Collec-State",null,1,"300","110","O",false,"Administration & Supporting Services",{"$f":"[2]ActiveFunds!$O16&\"-\"&[2]ActiveFunds!$R16","v":"110-Administration & Supporting Services"},null,"300110","110-Administration & Supporting Services",null,"2000-State Facility Services            "]
[null,"035-State Actuary","418-1 St Hlth Care Admn Ac-State",{"$f":"LEFT(Table_clallam_Oversight_ActiveFunds[[#This Row],[Fund]],5)","v":"418-1"},null,"050",14,"048-Court of Appeals","048","003-1","003-1 Architects' License-State",null,1,"300","135","O",false,"Special Commitment Center",{"$f":"[2]ActiveFunds!$O17&\"-\"&[2]ActiveFunds!$R17","v":"135-Special Commitment Center"},null,"300135","135-Special Commitment Center",null,"1000-Community Services/RSN             "]
[null,"035-State Actuary","492-1 School Employees' In-State",{"$f":"LEFT(Table_clallam_Oversight_ActiveFunds[[#This Row],[Fund]],5)","v":"492-1"},null,"055",15,"050-Judicial Conduct","050","006-1","006-1 Public Records Effic-State",null,1,"300","145","O",false,"Payments to Other Agencies",{"$f":"[2]ActiveFunds!$O18&\"-\"&[2]ActiveFunds!$R18","v":"145-Payments to Other Agencies"},null,"300145","145-Payments to Other Agencies",null,"2000-State Facility Services            "]
[null,"035-State Actuary","600-1 Retirmnt Sys Expense-State",{"$f":"LEFT(Table_clallam_Oversight_ActiveFunds[[#This Row],[Fund]],5)","v":"600-1"},null,"056",16,"055-Admin Office Courts","055","007-1","007-1 Winter Recreation-State",null,1,"300","150","O",false,"Information System Services",{"$f":"[2]ActiveFunds!$O19&\"-\"&[2]ActiveFunds!$R19","v":"150-Information System Services"},null,"300150","150-Information System Services",null,"9000-Program Support                    "]
[null,"036-St Leg Labor Rel","001-1 General Fund-State",{"$f":"LEFT(Table_clallam_Oversight_ActiveFunds[[#This Row],[Fund]],5)","v":"001-1"},null,"057",17,"056-Public Defense","056","014-1","014-1 Forest Development-State",null,1,"300","160","O",false,"Consolidated Field Services",{"$f":"[2]ActiveFunds!$O20&\"-\"&[2]ActiveFunds!$R20","v":"160-Consolidated Field Services"},null,"300160","160-Consolidated Field Services"]
[null,"037-Leg Support Services","001-1 General Fund-State",{"$f":"LEFT(Table_clallam_Oversight_ActiveFunds[[#This Row],[Fund]],5)","v":"001-1"},null,"075",18,"057-Civil Legal Aid","057","018-1","018-1 Millersylvania Park-State",null,1,"305","010","O",false,"Headquarters",{"$f":"[2]ActiveFunds!$O21&\"-\"&[2]ActiveFunds!$R21","v":"010-Headquarters"},null,"305010","010-Headquarters",null,null,null,{"$f":"IF(AND(LEFT(X5,3)=\"300\",LEFT(Y5,3)=\"030\"),$Z$5:$Z$8,IF(AND(LEFT(X5,3)=\"300\",LEFT(Y5,3)=\"040\"),$Z$9:$Z$12,\"\"))","v":{"$error":"#VALUE!"}}]
[null,"037-Leg Support Services","442-6 Leg Gift Center Acct-Non-Appr",{"$f":"LEFT(Table_clallam_Oversight_ActiveFunds[[#This Row],[Fund]],5)","v":"442-6"},null,"080",19,"075-Governor","075","01B-1","01B-1 ORV/NonHiwy Veh Acct-State",null,1,"305","020","O",false,"Field Services",{"$f":"[2]ActiveFunds!$O22&\"-\"&[2]ActiveFunds!$R22","v":"020-Field Services"},null,"305020","020-Field Services",null,null,null,{"$f":"IF(AND(LEFT(X6,3)=\"300\",LEFT(Y6,3)=\"030\"),$Z$5:$Z$8,IF(AND(LEFT(X6,3)=\"300\",LEFT(Y6,3)=\"040\"),$Z$9:$Z$12,\"\"))","v":{"$error":"#VALUE!"}}]
[null,"038-Joint Leg Syst Comm","001-1 General Fund-State",{"$f":"LEFT(Table_clallam_Oversight_ActiveFunds[[#This Row],[Fund]],5)","v":"001-1"},null,"082",20,"076-Spec Approps to Gov","076","01F-6","01F-6 Crime Victims Compen-Non-Appr",null,1,"305","035","O",false,"Institutional Services",{"$f":"[2]ActiveFunds!$O23&\"-\"&[2]ActiveFunds!$R23","v":"035-Institutional Services"},null,"305035","035-Institutional Services",null,null,null,{"$error":"#VALUE!"}]
[null,"040-Statute Law Comm","001-1 General Fund-State",{"$f":"LEFT(Table_clallam_Oversight_ActiveFunds[[#This Row],[Fund]],5)","v":"001-1"},null,"085",21,"080-Lieutenant Governor","080","01M-1","01M-1 Snowmobile Account-State",null,1,"307","010","O",false,"Children and Family",{"$f":"[2]ActiveFunds!$O24&\"-\"&[2]ActiveFunds!$R24","v":"010-Children and Family"},null,"307010","010-Children and Family",null,null,null,{"$error":"#VALUE!"}]
[null,"040-Statute Law Comm","197-6 Statute Law Comm Pub-Non-Appr",{"$f":"LEFT(Table_clallam_Oversight_ActiveFunds[[#This Row],[Fund]],5)","v":"197-6"},null,"086",22,"082-Public Disclosure","082","024-1","024-1 Profess Engineers'-State",null,1,"307","020","O",false,"Juvenile Rehabilitation",{"$f":"[2]ActiveFunds!$O25&\"-\"&[2]ActiveFunds!$R25","v":"020-Juvenile Rehabilitation"},null,"307020","020-Juvenile Rehabilitation",null,null,null,{"$error":"#VALUE!"}]
[null,"045-Supreme Court","001-1 General Fund-State",{"$f":"LEFT(Table_clallam_Oversight_ActiveFunds[[#This Row],[Fund]],5)","v":"001-1"},null,"087",23,"083-WA St Leadership Bd","083","025-1","025-1 Pilotage Account-State",null,1,"307","030","O",false,"Early Learning",{"$f":"[2]ActiveFunds!$O26&\"-\"&[2]ActiveFunds!$R26","v":"030-Early Learning"},null,"307030","030-Early Learning",null,null,null,{"$error":"#VALUE!"}]
[null,"046-State Law Library","001-1 General Fund-State",{"$f":"LEFT(Table_clallam_Oversight_ActiveFunds[[#This Row],[Fund]],5)","v":"001-1"},null,"090",24,"085-Secretary of State","085","026-1","026-1 Real Estate Cmsn-State",null,1,"307","090","O",false,"Program Support",{"$f":"[2]ActiveFunds!$O27&\"-\"&[2]ActiveFunds!$R27","v":"090-Program Support"},null,"307090","090-Program Support",null,null,null,{"$error":"#VALUE!"}]
[null,"048-Court of Appeals","001-1 General Fund-State",{"$f":"LEFT(Table_clallam_Oversight_ActiveFunds[[#This Row],[Fund]],5)","v":"001-1"},null,"095",25,"086-Indian Affairs","086","027-1","027-1 Reclamation Acct-State",null,1,"310","100","O",false,"Administration & Support Services",{"$f":"[2]ActiveFunds!$O28&\"-\"&[2]ActiveFunds!$R28","v":"100-Administration & Support Services"},null,"310100","100-Administration & Support Services",null,null,null,{"$error":"#VALUE!"}]
[null,"050-Judicial Conduct","001-1 General Fund-State",{"$f":"LEFT(Table_clallam_Oversight_ActiveFunds[[#This Row],[Fund]],5)","v":"001-1"},null,"099",26,"087-Asian-Pac-Amer Affr","087","02A-1","02A-1 Surveys & Maps Acct-State",null,1,"310","200","O",false,"Correctional Operations",{"$f":"[2]ActiveFunds!$O29&\"-\"&[2]ActiveFunds!$R29","v":"200-Correctional Operations"},null,"310200","200-Correctional Operations",null,null,null,""]
[null,"055-Admin Office Courts","001-1 General Fund-State",{"$f":"LEFT(Table_clallam_Oversight_ActiveFunds[[#This Row],[Fund]],5)","v":"001-1"},null,"100",27,"090-State Treasurer","090","02G-1","02G-1 Health Prfessns Acct-State",null,1,"310","300","O",false,"Community Supervision",{"$f":"[2]ActiveFunds!$O30&\"-\"&[2]ActiveFunds!$R30","v":"300-Community Supervision"},null,"310300","300-Community Supervision",null,null,null,""]
{"$rows_left_out":832}